Hospital Service Area,Hospital County,Operating Certificate Number,Permanent Facility Id,Facility Name,Age Group,Zip Code - 3 digits,Gender,Race,Ethnicity,Length of Stay,Type of Admission,Patient Disposition,Discharge Year,CCS Diagnosis Code,CCS Diagnosis Description,CCS Procedure Code,CCS Procedure Description,APR DRG Code,APR DRG Description,APR MDC Code,APR MDC Description,APR Severity of Illness Code,APR Severity of Illness Description,APR Risk of Mortality,APR Medical Surgical Description,Payment Typology 1,Payment Typology 2,Payment Typology 3,Birth Weight,Abortion Edit Indicator,Emergency Department Indicator,Total Charges,Total Costs
New York City,Manhattan,7002017,001450,Lenox Hill Hospital,30 to 49,100,F,White,Not Span/Hispanic,6,Elective,Home or Self Care,2019,NEO005,HEAD AND NECK CANCERS - NASOPHARYNGEAL,ENT013,ENT REPAIR,098,"OTHER EAR, NOSE, MOUTH & THROAT PROCEDURES",03,"DISEASES AND DISORDERS OF THE EAR, NOSE, MOUTH AND THROAT",1,Minor,Minor,Surgical,Private Health Insurance,,,,,false,94115.52,19426.09
Finger Lakes,Monroe,2701003,000411,Rochester General Hospital,50 to 69,144,M,Other Race,Spanish/Hispanic,8,Emergency,Home w/ Home Health Services,2019,RSP007,OTHER SPECIFIED AND UNSPECIFIED UPPER RESPIRATORY DISEASE,RES010,TRACHEOSTOMY,098,"OTHER EAR, NOSE, MOUTH & THROAT PROCEDURES",03,"DISEASES AND DISORDERS OF THE EAR, NOSE, MOUTH AND THROAT",1,Minor,Moderate,Surgical,Medicaid,,,,,true,58143.79,22437.37
New York City,Bronx,7000008,001172,Lincoln Medical & Mental Health Center,18 to 29,104,M,Black/African American,Not Span/Hispanic,2,Emergency,Home or Self Care,2019,INJ011,"OPEN WOUNDS OF HEAD AND NECK, INITIAL ENCOUNTER",ENT013,ENT REPAIR,098,"OTHER EAR, NOSE, MOUTH & THROAT PROCEDURES",03,"DISEASES AND DISORDERS OF THE EAR, NOSE, MOUTH AND THROAT",1,Minor,Minor,Surgical,Miscellaneous/Other,Medicaid,Medicaid,,,true,16623.46,9817.1
New York City,Bronx,7000006,001169,Montefiore Medical Center - Henry & Lucy Moses Div,50 to 69,104,M,Other Race,Spanish/Hispanic,1,Elective,Home or Self Care,2019,DIG003,DISEASES OF MOUTH; EXCLUDING DENTAL,ENT010,SALIVARY GLAND EXCISION,098,"OTHER EAR, NOSE, MOUTH & THROAT PROCEDURES",03,"DISEASES AND DISORDERS OF THE EAR, NOSE, MOUTH AND THROAT",1,Minor,Minor,Surgical,Private Health Insurance,,,,,false,38795.79,6931.97
Western NY,Erie,1401005,000210,Erie County Medical Center,18 to 29,142,F,White,Not Span/Hispanic,3,Emergency,Home or Self Care,2019,DIG003,DISEASES OF MOUTH; EXCLUDING DENTAL,MST005,INCISION AND DRAINAGE OF SUBCUTANEOUS TISSUE AND FASCIA,098,"OTHER EAR, NOSE, MOUTH & THROAT PROCEDURES",03,"DISEASES AND DISORDERS OF THE EAR, NOSE, MOUTH AND THROAT",1,Minor,Minor,Surgical,Private Health Insurance,,,,,true,20911.3,12682.19
New York City,Manhattan,7002053,001463,NYU Langone Hospitals,50 to 69,112,M,Black/African American,Not Span/Hispanic,6,Emergency,Home or Self Care,2019,RSP006,OTHER SPECIFIED UPPER RESPIRATORY INFECTIONS,MST005,INCISION AND DRAINAGE OF SUBCUTANEOUS TISSUE AND FASCIA,098,"OTHER EAR, NOSE, MOUTH & THROAT PROCEDURES",03,"DISEASES AND DISORDERS OF THE EAR, NOSE, MOUTH AND THROAT",3,Major,Moderate,Surgical,Private Health Insurance,,,,,true,95661.16,28118.7
Capital/Adirond,Albany,0101000,000001,Albany Medical Center Hospital,50 to 69,120,M,White,Not Span/Hispanic,6,Elective,Home w/ Home Health Services,2019,NEO002,HEAD AND NECK CANCERS - LIP AND ORAL CAVITY,ENT011,LARYNGECTOMY,098,"OTHER EAR, NOSE, MOUTH & THROAT PROCEDURES",03,"DISEASES AND DISORDERS OF THE EAR, NOSE, MOUTH AND THROAT",3,Major,Moderate,Surgical,"Managed Care, Unspecified",,,,,false,28333.69,10526.47
Long Island,Suffolk,5154001,000925,Good Samaritan Hospital Medical Center,0 to 17,117,M,Other Race,Spanish/Hispanic,2,Emergency,Home or Self Care,2019,INJ001,"FRACTURE OF HEAD AND NECK, INITIAL ENCOUNTER",MST012,BONE FIXATION (EXCLUDING EXTREMITIES),098,"OTHER EAR, NOSE, MOUTH & THROAT PROCEDURES",03,"DISEASES AND DISORDERS OF THE EAR, NOSE, MOUTH AND THROAT",1,Minor,Minor,Surgical,Medicaid,Medicaid,,,,true,23020.52,6037.24
Western NY,Erie,1401014,000208,John R. Oishei Children's Hospital,0 to 17,147,M,Other Race,Not Span/Hispanic,7,Elective,Home or Self Care,2019,NEO073,BENIGN NEOPLASMS,ENT008,NASAL AND SINUS EXCISION,098,"OTHER EAR, NOSE, MOUTH & THROAT PROCEDURES",03,"DISEASES AND DISORDERS OF THE EAR, NOSE, MOUTH AND THROAT",1,Minor,Minor,Surgical,Blue Cross/Blue Shield,Self-Pay,,,,false,267090.61,127084.53
New York City,Bronx,7000006,001169,Montefiore Medical Center - Henry & Lucy Moses Div,30 to 49,104,F,White,Not Span/Hispanic,9,Emergency,Home or Self Care,2019,MAL006,CLEFT LIP OR PALATE,RES010,TRACHEOSTOMY,098,"OTHER EAR, NOSE, MOUTH & THROAT PROCEDURES",03,"DISEASES AND DISORDERS OF THE EAR, NOSE, MOUTH AND THROAT",3,Major,Major,Surgical,Private Health Insurance,,,,,false,150726.62,30056.85
Long Island,Suffolk,5154001,000925,Good Samaritan Hospital Medical Center,50 to 69,117,F,White,Not Span/Hispanic,3,Emergency,Home or Self Care,2019,INJ001,"FRACTURE OF HEAD AND NECK, INITIAL ENCOUNTER",MST012,BONE FIXATION (EXCLUDING EXTREMITIES),098,"OTHER EAR, NOSE, MOUTH & THROAT PROCEDURES",03,"DISEASES AND DISORDERS OF THE EAR, NOSE, MOUTH AND THROAT",2,Moderate,Moderate,Surgical,Medicare,Medicare,"Managed Care, Unspecified",,,true,38842.44,7270.63
Western NY,Erie,1401014,003067,Millard Fillmore Suburban Hospital,18 to 29,142,M,White,Not Span/Hispanic,5,Emergency,Home or Self Care,2019,DIG002,DISORDERS OF TEETH AND GINGIVA,ENT006,ENT DRAINAGE (EXCLUDING MYRINGOTOMY),098,"OTHER EAR, NOSE, MOUTH & THROAT PROCEDURES",03,"DISEASES AND DISORDERS OF THE EAR, NOSE, MOUTH AND THROAT",2,Moderate,Minor,Surgical,Federal/State/Local/VA,Self-Pay,,,,true,15232.3,7573.97
Western NY,Erie,1401005,000210,Erie County Medical Center,50 to 69,142,M,White,Not Span/Hispanic,5,Elective,Home w/ Home Health Services,2019,NEO008,HEAD AND NECK CANCERS - LARYNGEAL,RES010,TRACHEOSTOMY,098,"OTHER EAR, NOSE, MOUTH & THROAT PROCEDURES",03,"DISEASES AND DISORDERS OF THE EAR, NOSE, MOUTH AND THROAT",2,Moderate,Minor,Surgical,Medicaid,Medicaid,,,,false,20324.5,12487.41
Western NY,Erie,1401005,000210,Erie County Medical Center,30 to 49,141,M,White,Not Span/Hispanic,1,Emergency,Home or Self Care,2019,DIG003,DISEASES OF MOUTH; EXCLUDING DENTAL,MST005,INCISION AND DRAINAGE OF SUBCUTANEOUS TISSUE AND FASCIA,098,"OTHER EAR, NOSE, MOUTH & THROAT PROCEDURES",03,"DISEASES AND DISORDERS OF THE EAR, NOSE, MOUTH AND THROAT",1,Minor,Minor,Surgical,Blue Cross/Blue Shield,,,,,true,11593.01,5111.5
Western NY,Erie,1401005,000210,Erie County Medical Center,50 to 69,140,F,White,Not Span/Hispanic,3,Emergency,Home or Self Care,2019,DIG003,DISEASES OF MOUTH; EXCLUDING DENTAL,MST005,INCISION AND DRAINAGE OF SUBCUTANEOUS TISSUE AND FASCIA,098,"OTHER EAR, NOSE, MOUTH & THROAT PROCEDURES",03,"DISEASES AND DISORDERS OF THE EAR, NOSE, MOUTH AND THROAT",1,Minor,Minor,Surgical,Federal/State/Local/VA,,,,,true,16677.24,8949.28
Long Island,Nassau,2950001,000527,Mount Sinai South Nassau,30 to 49,115,F,White,Not Span/Hispanic,2,Emergency,Home or Self Care,2019,DIG002,DISORDERS OF TEETH AND GINGIVA,ENT006,ENT DRAINAGE (EXCLUDING MYRINGOTOMY),098,"OTHER EAR, NOSE, MOUTH & THROAT PROCEDURES",03,"DISEASES AND DISORDERS OF THE EAR, NOSE, MOUTH AND THROAT",2,Moderate,Minor,Surgical,Medicaid,Medicaid,,,,true,45515.36,8181.44
Finger Lakes,Monroe,2701005,000413,Strong Memorial Hospital,70 or Older,144,M,White,Not Span/Hispanic,12,Emergency,Home w/ Home Health Services,2019,NEO008,HEAD AND NECK CANCERS - LARYNGEAL,RES010,TRACHEOSTOMY,098,"OTHER EAR, NOSE, MOUTH & THROAT PROCEDURES",03,"DISEASES AND DISORDERS OF THE EAR, NOSE, MOUTH AND THROAT",3,Major,Moderate,Surgical,Federal/State/Local/VA,,,,,true,42276.05,22226.9
Finger Lakes,Monroe,2701005,000413,Strong Memorial Hospital,18 to 29,146,M,White,Not Span/Hispanic,8,Emergency,Home or Self Care,2019,NEO073,BENIGN NEOPLASMS,ENT002,ENT DIAGNOSTIC ENDOSCOPY (EXCLUDING LARYNGOSCOPY),098,"OTHER EAR, NOSE, MOUTH & THROAT PROCEDURES",03,"DISEASES AND DISORDERS OF THE EAR, NOSE, MOUTH AND THROAT",2,Moderate,Minor,Surgical,Blue Cross/Blue Shield,,,,,true,95941.22,49668.81
Hudson Valley,Westchester,5957001,001139,Westchester Medical Center,0 to 17,107,F,Other Race,Unknown,9,Elective,Inpatient Rehabilitation Facility,2019,NVS016,SLEEP WAKE DISORDERS,RES010,TRACHEOSTOMY,098,"OTHER EAR, NOSE, MOUTH & THROAT PROCEDURES",03,"DISEASES AND DISORDERS OF THE EAR, NOSE, MOUTH AND THROAT",3,Major,Minor,Surgical,Medicaid,,,,,false,417454.71,81632.59
New York City,Manhattan,7002024,001456,Mount Sinai Hospital,70 or Older,112,M,White,Not Span/Hispanic,6,Elective,Home w/ Home Health Services,2019,NEO008,HEAD AND NECK CANCERS - LARYNGEAL,RES010,TRACHEOSTOMY,098,"OTHER EAR, NOSE, MOUTH & THROAT PROCEDURES",03,"DISEASES AND DISORDERS OF THE EAR, NOSE, MOUTH AND THROAT",3,Major,Moderate,Surgical,Medicare,Private Health Insurance,Self-Pay,,,false,101682.37,32281.47
Capital/Adirond,Albany,0101004,000005,St. Peter's Hospital,30 to 49,122,F,Black/African American,Not Span/Hispanic,3,Elective,Home or Self Care,2019,DIG003,DISEASES OF MOUTH; EXCLUDING DENTAL,MST005,INCISION AND DRAINAGE OF SUBCUTANEOUS TISSUE AND FASCIA,098,"OTHER EAR, NOSE, MOUTH & THROAT PROCEDURES",03,"DISEASES AND DISORDERS OF THE EAR, NOSE, MOUTH AND THROAT",1,Minor,Minor,Surgical,Medicaid,Medicaid,,,,false,14019.65,6966.44
New York City,Manhattan,7002054,001464,New York-Presbyterian Hospital - Columbia Presbyterian Center,30 to 49,100,F,White,Spanish/Hispanic,1,Urgent,Home or Self Care,2019,DIG003,DISEASES OF MOUTH; EXCLUDING DENTAL,ENT009,TONGUE EXCISION,098,"OTHER EAR, NOSE, MOUTH & THROAT PROCEDURES",03,"DISEASES AND DISORDERS OF THE EAR, NOSE, MOUTH AND THROAT",1,Minor,Minor,Surgical,Medicaid,Self-Pay,,,,false,43076.79,12387.82
Long Island,Suffolk,5154001,000925,Good Samaritan Hospital Medical Center,30 to 49,117,M,White,Not Span/Hispanic,9,Emergency,Home or Self Care,2019,DIG003,DISEASES OF MOUTH; EXCLUDING DENTAL,ENT015,DENTAL PROCEDURES,098,"OTHER EAR, NOSE, MOUTH & THROAT PROCEDURES",03,"DISEASES AND DISORDERS OF THE EAR, NOSE, MOUTH AND THROAT",2,Moderate,Minor,Surgical,Medicare,Medicaid,,,,true,78967.85,15753.05
New York City,Bronx,7000008,001172,Lincoln Medical & Mental Health Center,18 to 29,104,M,Other Race,Spanish/Hispanic,2,Emergency,Home or Self Care,2019,DIG002,DISORDERS OF TEETH AND GINGIVA,ENT015,DENTAL PROCEDURES,098,"OTHER EAR, NOSE, MOUTH & THROAT PROCEDURES",03,"DISEASES AND DISORDERS OF THE EAR, NOSE, MOUTH AND THROAT",1,Minor,Minor,Surgical,Medicaid,,,,,true,12946.03,7645.37
New York City,Queens,7003000,001626,Elmhurst Hospital Center,18 to 29,,F,White,Not Span/Hispanic,3,Emergency,Short-term Hospital,2019,INJ001,"FRACTURE OF HEAD AND NECK, INITIAL ENCOUNTER",MST011,FIXATION OF LEG AND FOOT BONES,098,"OTHER EAR, NOSE, MOUTH & THROAT PROCEDURES",03,"DISEASES AND DISORDERS OF THE EAR, NOSE, MOUTH AND THROAT",2,Moderate,Minor,Surgical,Miscellaneous/Other,,,,,true,49332.21,29350.99
Hudson Valley,Westchester,5957001,001139,Westchester Medical Center,50 to 69,100,F,White,Not Span/Hispanic,1,Emergency,Home or Self Care,2019,INJ001,"FRACTURE OF HEAD AND NECK, INITIAL ENCOUNTER",PLC001,IMMOBILIZATION BY SPLINT OR OTHER EXTERNAL DEVICE,098,"OTHER EAR, NOSE, MOUTH & THROAT PROCEDURES",03,"DISEASES AND DISORDERS OF THE EAR, NOSE, MOUTH AND THROAT",1,Minor,Minor,Surgical,Medicare,Private Health Insurance,,,,true,19799.8,3284.47
Western NY,Erie,1401014,000208,John R. Oishei Children's Hospital,0 to 17,142,M,Black/African American,Not Span/Hispanic,2,Elective,Home or Self Care,2019,RSP007,OTHER SPECIFIED AND UNSPECIFIED UPPER RESPIRATORY DISEASE,ENT017,"ENT PROCEDURES, NEC",098,"OTHER EAR, NOSE, MOUTH & THROAT PROCEDURES",03,"DISEASES AND DISORDERS OF THE EAR, NOSE, MOUTH AND THROAT",2,Moderate,Minor,Surgical,Private Health Insurance,Self-Pay,,,,false,24297.7,10715.94
Western NY,Erie,1401014,000208,John R. Oishei Children's Hospital,0 to 17,142,M,Black/African American,Not Span/Hispanic,4,Elective,Home or Self Care,2019,RSP007,OTHER SPECIFIED AND UNSPECIFIED UPPER RESPIRATORY DISEASE,ENT017,"ENT PROCEDURES, NEC",098,"OTHER EAR, NOSE, MOUTH & THROAT PROCEDURES",03,"DISEASES AND DISORDERS OF THE EAR, NOSE, MOUTH AND THROAT",3,Major,Minor,Surgical,Medicaid,Self-Pay,,,,false,37066.35,16647.56
New York City,Kings,7001021,001306,New York - Presbyterian Brooklyn Methodist Hospital,70 or Older,112,F,White,Spanish/Hispanic,16,Emergency,Home w/ Home Health Services,2019,NEO008,HEAD AND NECK CANCERS - LARYNGEAL,RES010,TRACHEOSTOMY,098,"OTHER EAR, NOSE, MOUTH & THROAT PROCEDURES",03,"DISEASES AND DISORDERS OF THE EAR, NOSE, MOUTH AND THROAT",3,Major,Moderate,Surgical,Medicare,Blue Cross/Blue Shield,Medicaid,,,true,167122.37,54361.02
New York City,Manhattan,7002021,001454,Metropolitan Hospital Center,18 to 29,100,M,Other Race,Spanish/Hispanic,2,Emergency,Home or Self Care,2019,RSP006,OTHER SPECIFIED UPPER RESPIRATORY INFECTIONS,ENT006,ENT DRAINAGE (EXCLUDING MYRINGOTOMY),098,"OTHER EAR, NOSE, MOUTH & THROAT PROCEDURES",03,"DISEASES AND DISORDERS OF THE EAR, NOSE, MOUTH AND THROAT",2,Moderate,Minor,Surgical,"Managed Care, Unspecified",,,,,true,15531.58,12548.74
New York City,Manhattan,7002054,001458,New York-Presbyterian Hospital - New York Weill Cornell Center,30 to 49,112,F,Other Race,Not Span/Hispanic,14,Elective,Home w/ Home Health Services,2019,RSP007,OTHER SPECIFIED AND UNSPECIFIED UPPER RESPIRATORY DISEASE,RES010,TRACHEOSTOMY,098,"OTHER EAR, NOSE, MOUTH & THROAT PROCEDURES",03,"DISEASES AND DISORDERS OF THE EAR, NOSE, MOUTH AND THROAT",3,Major,Moderate,Surgical,"Managed Care, Unspecified",Medicaid,Self-Pay,,,false,226985.54,88197.81
New York City,Manhattan,7002032,001466,Mount Sinai West,50 to 69,112,F,Other Race,Not Span/Hispanic,1,Urgent,Home or Self Care,2019,NEO004,HEAD AND NECK CANCERS - SALIVARY GLAND,ENT010,SALIVARY GLAND EXCISION,098,"OTHER EAR, NOSE, MOUTH & THROAT PROCEDURES",03,"DISEASES AND DISORDERS OF THE EAR, NOSE, MOUTH AND THROAT",1,Minor,Minor,Surgical,Medicaid,Medicaid,Self-Pay,,,false,30688.43,9508.69
New York City,Manhattan,7002054,001464,New York-Presbyterian Hospital - Columbia Presbyterian Center,70 or Older,106,F,White,Not Span/Hispanic,20,Urgent,Home w/ Home Health Services,2019,NEO008,HEAD AND NECK CANCERS - LARYNGEAL,ENT011,LARYNGECTOMY,098,"OTHER EAR, NOSE, MOUTH & THROAT PROCEDURES",03,"DISEASES AND DISORDERS OF THE EAR, NOSE, MOUTH AND THROAT",3,Major,Major,Surgical,Medicare,Private Health Insurance,Self-Pay,,,false,259353.6,61576.33
New York City,Richmond,7004003,001740,Staten Island University Hosp-North,70 or Older,103,M,Black/African American,Not Span/Hispanic,15,Emergency,Home w/ Home Health Services,2019,DIG002,DISORDERS OF TEETH AND GINGIVA,ENT006,ENT DRAINAGE (EXCLUDING MYRINGOTOMY),098,"OTHER EAR, NOSE, MOUTH & THROAT PROCEDURES",03,"DISEASES AND DISORDERS OF THE EAR, NOSE, MOUTH AND THROAT",3,Major,Major,Surgical,Medicare,Medicare,,,,true,177608.13,46774.06
Finger Lakes,Monroe,2701001,000409,Highland Hospital,50 to 69,146,F,White,Not Span/Hispanic,4,Emergency,Short-term Hospital,2019,RSP007,OTHER SPECIFIED AND UNSPECIFIED UPPER RESPIRATORY DISEASE,ENT017,"ENT PROCEDURES, NEC",098,"OTHER EAR, NOSE, MOUTH & THROAT PROCEDURES",03,"DISEASES AND DISORDERS OF THE EAR, NOSE, MOUTH AND THROAT",2,Moderate,Minor,Surgical,Blue Cross/Blue Shield,Medicare,,,,true,25742.62,8863.92
Western NY,Erie,1401005,000210,Erie County Medical Center,30 to 49,142,M,White,Not Span/Hispanic,3,Emergency,Home or Self Care,2019,DIG003,DISEASES OF MOUTH; EXCLUDING DENTAL,ENT006,ENT DRAINAGE (EXCLUDING MYRINGOTOMY),098,"OTHER EAR, NOSE, MOUTH & THROAT PROCEDURES",03,"DISEASES AND DISORDERS OF THE EAR, NOSE, MOUTH AND THROAT",2,Moderate,Minor,Surgical,Medicaid,Medicaid,,,,true,16090.64,8605.44
New York City,Manhattan,7002054,001458,New York-Presbyterian Hospital - New York Weill Cornell Center,18 to 29,113,M,Other Race,Spanish/Hispanic,8,Emergency,Home w/ Home Health Services,2019,RSP001,SINUSITIS,ENT008,NASAL AND SINUS EXCISION,098,"OTHER EAR, NOSE, MOUTH & THROAT PROCEDURES",03,"DISEASES AND DISORDERS OF THE EAR, NOSE, MOUTH AND THROAT",4,Extreme,Major,Surgical,"Managed Care, Unspecified",Medicaid,Self-Pay,,,false,155922.03,48074.47
New York City,Manhattan,7002054,001458,New York-Presbyterian Hospital - New York Weill Cornell Center,50 to 69,OOS,M,Other Race,Not Span/Hispanic,24,Emergency,Home w/ Home Health Services,2019,NEO008,HEAD AND NECK CANCERS - LARYNGEAL,ENT011,LARYNGECTOMY,098,"OTHER EAR, NOSE, MOUTH & THROAT PROCEDURES",03,"DISEASES AND DISORDERS OF THE EAR, NOSE, MOUTH AND THROAT",3,Major,Major,Surgical,Medicare,Self-Pay,,,,true,365302.22,95524.61
New York City,Queens,7003010,001637,New York - Presbyterian/Queens,70 or Older,113,F,White,Not Span/Hispanic,1,Elective,Home or Self Care,2019,NEO002,HEAD AND NECK CANCERS - LIP AND ORAL CAVITY,ENT009,TONGUE EXCISION,098,"OTHER EAR, NOSE, MOUTH & THROAT PROCEDURES",03,"DISEASES AND DISORDERS OF THE EAR, NOSE, MOUTH AND THROAT",1,Minor,Minor,Surgical,Medicare,Private Health Insurance,Self-Pay,,,false,21711.91,7723.34
New York City,Manhattan,7002053,001463,NYU Langone Hospitals,0 to 17,100,M,Other Race,Spanish/Hispanic,4,Elective,Home or Self Care,2019,MAL005,"CONGENITAL MALFORMATIONS OF EYE, EAR, FACE, NECK",ENT013,ENT REPAIR,098,"OTHER EAR, NOSE, MOUTH & THROAT PROCEDURES",03,"DISEASES AND DISORDERS OF THE EAR, NOSE, MOUTH AND THROAT",2,Moderate,Minor,Surgical,Medicaid,,,,,false,88439.15,21981
Central NY,Onondaga,3301007,000635,University Hospital SUNY Health Science Center,0 to 17,134,F,White,Not Span/Hispanic,7,Emergency,Home or Self Care,2019,DIG003,DISEASES OF MOUTH; EXCLUDING DENTAL,MST005,INCISION AND DRAINAGE OF SUBCUTANEOUS TISSUE AND FASCIA,098,"OTHER EAR, NOSE, MOUTH & THROAT PROCEDURES",03,"DISEASES AND DISORDERS OF THE EAR, NOSE, MOUTH AND THROAT",1,Minor,Minor,Surgical,Private Health Insurance,,,,,true,57261.6,19207.82
New York City,Kings,7001037,001320,University Hospital of Brooklyn,50 to 69,112,F,White,Not Span/Hispanic,11,Emergency,Home w/ Home Health Services,2019,EAR002,DISEASES OF MIDDLE EAR AND MASTOID (EXCEPT OTITIS MEDIA),ENT008,NASAL AND SINUS EXCISION,098,"OTHER EAR, NOSE, MOUTH & THROAT PROCEDURES",03,"DISEASES AND DISORDERS OF THE EAR, NOSE, MOUTH AND THROAT",4,Extreme,Major,Surgical,Medicaid,Medicaid,Self-Pay,,,true,86239,54506.71
New York City,Manhattan,7002032,001466,Mount Sinai West,30 to 49,112,F,Other Race,Not Span/Hispanic,1,Elective,Home or Self Care,2019,NEO073,BENIGN NEOPLASMS,ENT010,SALIVARY GLAND EXCISION,098,"OTHER EAR, NOSE, MOUTH & THROAT PROCEDURES",03,"DISEASES AND DISORDERS OF THE EAR, NOSE, MOUTH AND THROAT",1,Minor,Minor,Surgical,Private Health Insurance,Self-Pay,,,,false,37656.67,12128.7
New York City,Manhattan,7002054,001464,New York-Presbyterian Hospital - Columbia Presbyterian Center,0 to 17,104,F,White,Spanish/Hispanic,2,Emergency,Home or Self Care,2019,INJ015,"AMPUTATION OF OTHER BODY PARTS, INITIAL ENCOUNTER",SKB007,SKIN GRAFT,098,"OTHER EAR, NOSE, MOUTH & THROAT PROCEDURES",03,"DISEASES AND DISORDERS OF THE EAR, NOSE, MOUTH AND THROAT",1,Minor,Minor,Surgical,Medicaid,Medicaid,Self-Pay,,,true,40374.6,11542.67
Capital/Adirond,Albany,0101000,000001,Albany Medical Center Hospital,30 to 49,120,M,White,Not Span/Hispanic,1,Emergency,Home or Self Care,2019,DIG003,DISEASES OF MOUTH; EXCLUDING DENTAL,MST005,INCISION AND DRAINAGE OF SUBCUTANEOUS TISSUE AND FASCIA,098,"OTHER EAR, NOSE, MOUTH & THROAT PROCEDURES",03,"DISEASES AND DISORDERS OF THE EAR, NOSE, MOUTH AND THROAT",2,Moderate,Minor,Surgical,Blue Cross/Blue Shield,,,,,true,8816.82,1981.76
Hudson Valley,Westchester,5957001,001139,Westchester Medical Center,50 to 69,105,F,Black/African American,Not Span/Hispanic,6,Elective,Skilled Nursing Home,2019,MUS029,DISORDERS OF JAW,MST008,ARTHROPLASTY OF OTHER JOINT (EXCLUDING KNEE AND HIP),098,"OTHER EAR, NOSE, MOUTH & THROAT PROCEDURES",03,"DISEASES AND DISORDERS OF THE EAR, NOSE, MOUTH AND THROAT",2,Moderate,Minor,Surgical,Medicare,Medicaid,,,,false,238745.92,45396.99
New York City,Manhattan,7002054,001458,New York-Presbyterian Hospital - New York Weill Cornell Center,30 to 49,112,M,Other Race,Not Span/Hispanic,1,Elective,Home or Self Care,2019,NEO002,HEAD AND NECK CANCERS - LIP AND ORAL CAVITY,ENT009,TONGUE EXCISION,098,"OTHER EAR, NOSE, MOUTH & THROAT PROCEDURES",03,"DISEASES AND DISORDERS OF THE EAR, NOSE, MOUTH AND THROAT",1,Minor,Minor,Surgical,Blue Cross/Blue Shield,Self-Pay,,,,false,48976.67,15730.18
New York City,Bronx,7000014,001176,SBH Health System,30 to 49,104,M,White,Unknown,1,Trauma,Home or Self Care,2019,INJ011,"OPEN WOUNDS OF HEAD AND NECK, INITIAL ENCOUNTER",MST028,"SUBCUTANEOUS TISSUE AND FASCIA PROCEDURES, NEC",098,"OTHER EAR, NOSE, MOUTH & THROAT PROCEDURES",03,"DISEASES AND DISORDERS OF THE EAR, NOSE, MOUTH AND THROAT",2,Moderate,Moderate,Surgical,Medicaid,Medicaid,,,,true,39004.1,13396.18
New York City,Queens,7003010,001637,New York - Presbyterian/Queens,70 or Older,110,F,Other Race,Not Span/Hispanic,1,Urgent,Home or Self Care,2019,NEO004,HEAD AND NECK CANCERS - SALIVARY GLAND,ENT010,SALIVARY GLAND EXCISION,098,"OTHER EAR, NOSE, MOUTH & THROAT PROCEDURES",03,"DISEASES AND DISORDERS OF THE EAR, NOSE, MOUTH AND THROAT",1,Minor,Minor,Surgical,Medicare,Blue Cross/Blue Shield,Self-Pay,,,false,20493.38,8090.46
New York City,Richmond,7004003,001740,Staten Island University Hosp-North,50 to 69,103,M,White,Not Span/Hispanic,1,Elective,Home or Self Care,2019,NEO002,HEAD AND NECK CANCERS - LIP AND ORAL CAVITY,LYM001,LYMPH NODE BIOPSY,098,"OTHER EAR, NOSE, MOUTH & THROAT PROCEDURES",03,"DISEASES AND DISORDERS OF THE EAR, NOSE, MOUTH AND THROAT",2,Moderate,Minor,Surgical,Private Health Insurance,,,,,false,38628.33,10541.64
New York City,Manhattan,7002032,001466,Mount Sinai West,30 to 49,101,F,White,Not Span/Hispanic,1,Urgent,Home or Self Care,2019,NEO073,BENIGN NEOPLASMS,ENT010,SALIVARY GLAND EXCISION,098,"OTHER EAR, NOSE, MOUTH & THROAT PROCEDURES",03,"DISEASES AND DISORDERS OF THE EAR, NOSE, MOUTH AND THROAT",1,Minor,Minor,Surgical,Private Health Insurance,Self-Pay,,,,false,32396.71,10227.36
Central NY,Onondaga,3301007,000635,University Hospital SUNY Health Science Center,70 or Older,131,M,White,Not Span/Hispanic,5,Emergency,Home or Self Care,2019,RSP007,OTHER SPECIFIED AND UNSPECIFIED UPPER RESPIRATORY DISEASE,RES010,TRACHEOSTOMY,098,"OTHER EAR, NOSE, MOUTH & THROAT PROCEDURES",03,"DISEASES AND DISORDERS OF THE EAR, NOSE, MOUTH AND THROAT",3,Major,Major,Surgical,Medicare,,,,,true,76678.26,20547.79
New York City,Bronx,7000014,001176,SBH Health System,70 or Older,104,M,White,Spanish/Hispanic,16,Emergency,Home or Self Care,2019,NEO008,HEAD AND NECK CANCERS - LARYNGEAL,RES010,TRACHEOSTOMY,098,"OTHER EAR, NOSE, MOUTH & THROAT PROCEDURES",03,"DISEASES AND DISORDERS OF THE EAR, NOSE, MOUTH AND THROAT",4,Extreme,Major,Surgical,Medicaid,Medicaid,,,,true,116900.7,39066.68
New York City,Kings,7001016,001301,Kings County Hospital Center,50 to 69,112,F,Black/African American,Not Span/Hispanic,12,Emergency,Home or Self Care,2019,RSP007,OTHER SPECIFIED AND UNSPECIFIED UPPER RESPIRATORY DISEASE,ENT017,"ENT PROCEDURES, NEC",098,"OTHER EAR, NOSE, MOUTH & THROAT PROCEDURES",03,"DISEASES AND DISORDERS OF THE EAR, NOSE, MOUTH AND THROAT",3,Major,Minor,Surgical,Medicaid,,,,,true,112820.96,80143.61
New York City,Bronx,7000006,001169,Montefiore Medical Center - Henry & Lucy Moses Div,18 to 29,,F,Other Race,Spanish/Hispanic,1,Emergency,Home or Self Care,2019,MAL006,CLEFT LIP OR PALATE,ENT017,"ENT PROCEDURES, NEC",098,"OTHER EAR, NOSE, MOUTH & THROAT PROCEDURES",03,"DISEASES AND DISORDERS OF THE EAR, NOSE, MOUTH AND THROAT",2,Moderate,Minor,Surgical,Private Health Insurance,,,,,false,38452.67,8282.65