Hospital Service Area,Hospital County,Operating Certificate Number,Permanent Facility Id,Facility Name,Age Group,Zip Code - 3 digits,Gender,Race,Ethnicity,Length of Stay,Type of Admission,Patient Disposition,Discharge Year,CCS Diagnosis Code,CCS Diagnosis Description,CCS Procedure Code,CCS Procedure Description,APR DRG Code,APR DRG Description,APR MDC Code,APR MDC Description,APR Severity of Illness Code,APR Severity of Illness Description,APR Risk of Mortality,APR Medical Surgical Description,Payment Typology 1,Payment Typology 2,Payment Typology 3,Birth Weight,Abortion Edit Indicator,Emergency Department Indicator,Total Charges,Total Costs
New York City,Kings,7002053,001304,NYU Langone Hospital-Brooklyn,30 to 49,112,F,Other Race,Spanish/Hispanic,3,Emergency,Home or Self Care,2019,NEO005,HEAD AND NECK CANCERS - NASOPHARYNGEAL,ENT002,ENT DIAGNOSTIC ENDOSCOPY (EXCLUDING LARYNGOSCOPY),098,"OTHER EAR, NOSE, MOUTH & THROAT PROCEDURES",03,"DISEASES AND DISORDERS OF THE EAR, NOSE, MOUTH AND THROAT",1,Minor,Minor,Surgical,Medicaid,,,,,true,85395.92,17560.16
New York City,Kings,7002053,001304,NYU Langone Hospital-Brooklyn,70 or Older,112,M,Other Race,Spanish/Hispanic,8,Emergency,Home w/ Home Health Services,2019,SYM013,RESPIRATORY SIGNS AND SYMPTOMS,ENT017,"ENT PROCEDURES, NEC",098,"OTHER EAR, NOSE, MOUTH & THROAT PROCEDURES",03,"DISEASES AND DISORDERS OF THE EAR, NOSE, MOUTH AND THROAT",3,Major,Moderate,Surgical,Self-Pay,,,,,true,268179.28,55343.06
New York City,Kings,7002053,001304,NYU Langone Hospital-Brooklyn,30 to 49,112,M,Other Race,Spanish/Hispanic,1,Emergency,Home or Self Care,2019,DIG002,DISORDERS OF TEETH AND GINGIVA,ENT006,ENT DRAINAGE (EXCLUDING MYRINGOTOMY),098,"OTHER EAR, NOSE, MOUTH & THROAT PROCEDURES",03,"DISEASES AND DISORDERS OF THE EAR, NOSE, MOUTH AND THROAT",1,Minor,Minor,Surgical,Medicaid,,,,,true,31428.06,11550.75
New York City,Kings,7002053,001304,NYU Langone Hospital-Brooklyn,70 or Older,112,M,White,Not Span/Hispanic,15,Emergency,Home or Self Care,2019,RSP007,OTHER SPECIFIED AND UNSPECIFIED UPPER RESPIRATORY DISEASE,ENT008,NASAL AND SINUS EXCISION,098,"OTHER EAR, NOSE, MOUTH & THROAT PROCEDURES",03,"DISEASES AND DISORDERS OF THE EAR, NOSE, MOUTH AND THROAT",4,Extreme,Major,Surgical,Medicare,,,,,true,279284.8,67120.83
New York City,Kings,7002053,001304,NYU Langone Hospital-Brooklyn,0 to 17,112,M,Other Race,Not Span/Hispanic,2,Emergency,Home or Self Care,2019,DIG002,DISORDERS OF TEETH AND GINGIVA,ENT006,ENT DRAINAGE (EXCLUDING MYRINGOTOMY),098,"OTHER EAR, NOSE, MOUTH & THROAT PROCEDURES",03,"DISEASES AND DISORDERS OF THE EAR, NOSE, MOUTH AND THROAT",2,Moderate,Minor,Surgical,Medicaid,,,,,true,38348.48,9523.25
New York City,Kings,7002053,001304,NYU Langone Hospital-Brooklyn,70 or Older,112,M,Other Race,Not Span/Hispanic,2,Emergency,Home or Self Care,2019,MUS029,DISORDERS OF JAW,ENT006,ENT DRAINAGE (EXCLUDING MYRINGOTOMY),098,"OTHER EAR, NOSE, MOUTH & THROAT PROCEDURES",03,"DISEASES AND DISORDERS OF THE EAR, NOSE, MOUTH AND THROAT",2,Moderate,Minor,Surgical,Medicare,Medicaid,,,,true,46019.8,15458.25
New York City,Kings,7002053,001304,NYU Langone Hospital-Brooklyn,70 or Older,112,F,White,Not Span/Hispanic,2,Emergency,Home or Self Care,2019,DIG002,DISORDERS OF TEETH AND GINGIVA,ENT006,ENT DRAINAGE (EXCLUDING MYRINGOTOMY),098,"OTHER EAR, NOSE, MOUTH & THROAT PROCEDURES",03,"DISEASES AND DISORDERS OF THE EAR, NOSE, MOUTH AND THROAT",2,Moderate,Moderate,Surgical,Medicare,Medicaid,,,,true,32435.81,8526.64
New York City,Kings,7002053,001304,NYU Langone Hospital-Brooklyn,30 to 49,112,F,Black/African American,Not Span/Hispanic,4,Emergency,Home or Self Care,2019,DIG003,DISEASES OF MOUTH; EXCLUDING DENTAL,MST005,INCISION AND DRAINAGE OF SUBCUTANEOUS TISSUE AND FASCIA,098,"OTHER EAR, NOSE, MOUTH & THROAT PROCEDURES",03,"DISEASES AND DISORDERS OF THE EAR, NOSE, MOUTH AND THROAT",1,Minor,Minor,Surgical,Private Health Insurance,,,,,true,64657.67,17752.13
New York City,Kings,7002053,001304,NYU Langone Hospital-Brooklyn,0 to 17,112,M,Black/African American,Not Span/Hispanic,1,Trauma,Home or Self Care,2019,INJ001,"FRACTURE OF HEAD AND NECK, INITIAL ENCOUNTER",MST018,BONE EXCISION,098,"OTHER EAR, NOSE, MOUTH & THROAT PROCEDURES",03,"DISEASES AND DISORDERS OF THE EAR, NOSE, MOUTH AND THROAT",2,Moderate,Minor,Surgical,Medicaid,,,,,true,34994.81,7956.93
New York City,Kings,7002053,001304,NYU Langone Hospital-Brooklyn,50 to 69,112,F,Other Race,Not Span/Hispanic,13,Emergency,Home or Self Care,2019,DIG003,DISEASES OF MOUTH; EXCLUDING DENTAL,MST005,INCISION AND DRAINAGE OF SUBCUTANEOUS TISSUE AND FASCIA,098,"OTHER EAR, NOSE, MOUTH & THROAT PROCEDURES",03,"DISEASES AND DISORDERS OF THE EAR, NOSE, MOUTH AND THROAT",1,Minor,Minor,Surgical,Medicaid,,,,,true,196129.39,60739.03
