Hospital Service Area,Hospital County,Operating Certificate Number,Permanent Facility Id,Facility Name,Age Group,Zip Code - 3 digits,Gender,Race,Ethnicity,Length of Stay,Type of Admission,Patient Disposition,Discharge Year,CCS Diagnosis Code,CCS Diagnosis Description,CCS Procedure Code,CCS Procedure Description,APR DRG Code,APR DRG Description,APR MDC Code,APR MDC Description,APR Severity of Illness Code,APR Severity of Illness Description,APR Risk of Mortality,APR Medical Surgical Description,Payment Typology 1,Payment Typology 2,Payment Typology 3,Birth Weight,Abortion Edit Indicator,Emergency Department Indicator,Total Charges,Total Costs
Long Island,Nassau,2908000,000511,NYU Langone Hospital-Long Island,50 to 69,117,M,White,Spanish/Hispanic,5,Emergency,Home or Self Care,2019,RSP007,OTHER SPECIFIED AND UNSPECIFIED UPPER RESPIRATORY DISEASE,RES014,"RESPIRATORY SYSTEM PROCEDURES, NEC",098,"OTHER EAR, NOSE, MOUTH & THROAT PROCEDURES",03,"DISEASES AND DISORDERS OF THE EAR, NOSE, MOUTH AND THROAT",3,Major,Moderate,Surgical,Private Health Insurance,Medicare,,,,true,110467.54,18791.55
Long Island,Nassau,2908000,000511,NYU Langone Hospital-Long Island,30 to 49,115,M,Other Race,Spanish/Hispanic,3,Emergency,Home or Self Care,2019,DIG002,DISORDERS OF TEETH AND GINGIVA,ENT006,ENT DRAINAGE (EXCLUDING MYRINGOTOMY),098,"OTHER EAR, NOSE, MOUTH & THROAT PROCEDURES",03,"DISEASES AND DISORDERS OF THE EAR, NOSE, MOUTH AND THROAT",1,Minor,Minor,Surgical,Medicaid,,,,,true,34840.66,6681.58
Long Island,Nassau,2908000,000511,NYU Langone Hospital-Long Island,30 to 49,110,F,White,Not Span/Hispanic,3,Emergency,Home or Self Care,2019,DIG002,DISORDERS OF TEETH AND GINGIVA,ENT006,ENT DRAINAGE (EXCLUDING MYRINGOTOMY),098,"OTHER EAR, NOSE, MOUTH & THROAT PROCEDURES",03,"DISEASES AND DISORDERS OF THE EAR, NOSE, MOUTH AND THROAT",1,Minor,Minor,Surgical,Private Health Insurance,,,,,true,59146.21,9678.87
Long Island,Nassau,2908000,000511,NYU Langone Hospital-Long Island,50 to 69,110,F,White,Not Span/Hispanic,4,Trauma,Home or Self Care,2019,INJ001,"FRACTURE OF HEAD AND NECK, INITIAL ENCOUNTER",MST012,BONE FIXATION (EXCLUDING EXTREMITIES),098,"OTHER EAR, NOSE, MOUTH & THROAT PROCEDURES",03,"DISEASES AND DISORDERS OF THE EAR, NOSE, MOUTH AND THROAT",2,Moderate,Minor,Surgical,Medicare,Medicare,,,,true,112347.8,17732.41
Long Island,Nassau,2908000,000511,NYU Langone Hospital-Long Island,0 to 17,115,M,White,Spanish/Hispanic,12,Emergency,Home w/ Home Health Services,2019,RSP007,OTHER SPECIFIED AND UNSPECIFIED UPPER RESPIRATORY DISEASE,ENT017,"ENT PROCEDURES, NEC",098,"OTHER EAR, NOSE, MOUTH & THROAT PROCEDURES",03,"DISEASES AND DISORDERS OF THE EAR, NOSE, MOUTH AND THROAT",4,Extreme,Extreme,Surgical,Blue Cross/Blue Shield,Medicaid,,,,true,204569.78,39175.23
Long Island,Nassau,2908000,000511,NYU Langone Hospital-Long Island,0 to 17,117,F,Other Race,Not Span/Hispanic,1,Emergency,Home or Self Care,2019,INJ001,"FRACTURE OF HEAD AND NECK, INITIAL ENCOUNTER",MST012,BONE FIXATION (EXCLUDING EXTREMITIES),098,"OTHER EAR, NOSE, MOUTH & THROAT PROCEDURES",03,"DISEASES AND DISORDERS OF THE EAR, NOSE, MOUTH AND THROAT",2,Moderate,Minor,Surgical,Medicaid,Medicaid,,,,true,62630.9,8937.81
Long Island,Nassau,2908000,000511,NYU Langone Hospital-Long Island,18 to 29,110,M,White,Not Span/Hispanic,3,Emergency,Home or Self Care,2019,DIG002,DISORDERS OF TEETH AND GINGIVA,ENT012,"ENT EXCISION (EXCLUDING NASAL PASSAGE, SINUSES, TONGUE, SALIVARY GLANDS, LARYNX)",098,"OTHER EAR, NOSE, MOUTH & THROAT PROCEDURES",03,"DISEASES AND DISORDERS OF THE EAR, NOSE, MOUTH AND THROAT",1,Minor,Minor,Surgical,Blue Cross/Blue Shield,,,,,true,50166.38,9208.16
Long Island,Nassau,2908000,000511,NYU Langone Hospital-Long Island,70 or Older,110,F,White,Not Span/Hispanic,5,Emergency,Skilled Nursing Home,2019,INJ001,"FRACTURE OF HEAD AND NECK, INITIAL ENCOUNTER",ENT013,ENT REPAIR,098,"OTHER EAR, NOSE, MOUTH & THROAT PROCEDURES",03,"DISEASES AND DISORDERS OF THE EAR, NOSE, MOUTH AND THROAT",3,Major,Major,Surgical,Medicare,Medicare,,,,true,61689.81,11462.14
Long Island,Nassau,2908000,000511,NYU Langone Hospital-Long Island,0 to 17,115,M,White,Not Span/Hispanic,1,Elective,Home or Self Care,2019,EAR001,OTITIS MEDIA,ENT005,MYRINGOTOMY,098,"OTHER EAR, NOSE, MOUTH & THROAT PROCEDURES",03,"DISEASES AND DISORDERS OF THE EAR, NOSE, MOUTH AND THROAT",1,Minor,Minor,Surgical,Blue Cross/Blue Shield,,,,,false,50315.2,7936.76
